trance-n
type: LexicalEntry
canonical form: trance
sense: 92460865-n
part of speech: noun

92460865-n
type: LexicalConcept
in scheme: en-word.net
definition: A genre of electronic dance music with a fast tempo, repetitive phrasing, and often a hypnotic effect.
example: Classic trance employs a 4/4 time signature, a tempo of 125 to 150 BPM, and 32 beat phrases and is somewhat faster than house music
lexfile: noun.communication
part of speech: noun
source: plWordNet 4.0
hypernym: 07074737-n