heavyweight-n
type: LexicalEntry
canonical form: heavyweight
sense: 92424039-n
part of speech: noun

super heavyweight-n
type: LexicalEntry
canonical form: super heavyweight
sense: 92424039-n
part of speech: noun

92424039-n
type: LexicalConcept
in scheme: en-word.net
definition: A weight class division in combat sports, often the heaviest.
lexfile: noun.group
part of speech: noun
source: plWordNet 4.0
hypernym: 92424028-n