wittiness-n
type: LexicalEntry
canonical form: wittiness
sense: 92422347-n
part of speech: noun

92422347-n
type: LexicalConcept
in scheme: en-word.net
definition: The quality of being clever, amusingly ingenious.
example: And the result would be that he would kill the wittiness of the lines by burlesque.
lexfile: noun.attribute
part of speech: noun
source: plWordNet 4.0
hypernym: 04656408-n