bulk-v
type: LexicalEntry
canonical form: bulk
sense: 91000441-v
part of speech: verb

91000441-v
type: LexicalConcept
in scheme: en-word.net
definition: to gain size and weight by means of exercise and diet
lexfile: verb.change
part of speech: verb
source: Colloquial WordNet
hypernym: 00231172-v