playground ball-n
type: LexicalEntry
canonical form: playground ball
sense: 88571022-n
part of speech: noun

88571022-n
type: LexicalConcept
in scheme: en-word.net
definition: a large rubber ball used in various playground games including four square, kickball, and dodgeball
lexfile: noun.artifact
part of speech: noun
hypernym: 02781674-n