king-n
type: LexicalEntry
canonical form: king
sense: 88005275-n
part of speech: noun

88005275-n
type: LexicalConcept
in scheme: en-word.net
definition: a male competitor who holds a preeminent position
lexfile: noun.person
part of speech: noun
hypernym: 10306910-n
hypernym: 10254721-n