merchandise-n
type: LexicalEntry
canonical form: merchandise
sense: 80664327-n
part of speech: noun

merchandising-n
type: LexicalEntry
canonical form: merchandising
sense: 80664327-n
part of speech: noun

80664327-n
type: LexicalConcept
in scheme: en-word.net
definition: branded products meant to promote another product, especially films and pop groups
lexfile: noun.artifact
part of speech: noun
hypernym: 03754377-n