generation-n
type: LexicalEntry
canonical form: generation
sense: 15316166-n
part of speech: noun

15316166-n
type: LexicalConcept
in scheme: en-word.net
definition: a stage of technological development or innovation
example: the third generation of computers
ili: i117603
lexfile: noun.time
part of speech: noun
hypernym: 15315573-n