phase-n
type: LexicalEntry
canonical form: phase
sense: 15315368-n
part of speech: noun

phase angle-n
type: LexicalEntry
canonical form: phase angle
sense: 15315368-n
part of speech: noun

15315368-n
type: LexicalConcept
in scheme: en-word.net
definition: a particular point in the time of a cycle; measured from some arbitrary zero and expressed as an angle
ili: i117601
lexfile: noun.time
part of speech: noun
hypernym: 15205381-n