attendance-n
type: LexicalEntry
canonical form: attendance
sense: 15310217-n
part of speech: noun

15310217-n
type: LexicalConcept
in scheme: en-word.net
definition: the frequency with which a person is present
example: a student's attendance is an important factor in her grade
ili: i117578
lexfile: noun.time
part of speech: noun
hypernym: 15303267-n