jerk-n
type: LexicalEntry
canonical form: jerk
sense: 15304501-n
part of speech: noun

15304501-n
type: LexicalConcept
in scheme: en-word.net
definition: (mechanics) the rate of change of acceleration
ili: i117544
lexfile: noun.time
part of speech: noun
domain topic: 06109843-n
hypernym: 15311467-n