tempo-n
type: LexicalEntry
canonical form: tempo
sense: 15289174-n
part of speech: noun

pacing-n
type: LexicalEntry
canonical form: pacing
sense: 15289174-n
part of speech: noun

15289174-n
type: LexicalConcept
in scheme: en-word.net
definition: (music) the speed at which a composition is to be played
ili: i117462
lexfile: noun.time
part of speech: noun
domain topic: 07034009-n
hypernym: 15146953-n