run-n
type: LexicalEntry
canonical form: run
sense: 15286931-n
part of speech: noun

15286931-n
type: LexicalConcept
in scheme: en-word.net
definition: the continuous period of time during which something (a machine or a factory) operates or continues in operation
example: the assembly line was on a 12-hour run
ili: i117447
lexfile: noun.time
part of speech: noun
hypernym: 15137796-n