period-n
type: LexicalEntry
canonical form: period
sense: 15283092-n
part of speech: noun

15283092-n
type: LexicalConcept
in scheme: en-word.net
definition: (ice hockey) one of three divisions into which play is divided in hockey games
ili: i117428
lexfile: noun.time
part of speech: noun
domain topic: 00464604-n
hypernym: 05876035-n