season-n
type: LexicalEntry
canonical form: season
sense: 15264376-n
part of speech: noun

15264376-n
type: LexicalConcept
in scheme: en-word.net
definition: a period of the year marked by special events or activities in some field
example: he celebrated his 10th season with the ballet company
example: she always looked forward to the avocado season
ili: i117324
lexfile: noun.time
part of speech: noun
hypernym: 15137796-n