spring-n
type: LexicalEntry
canonical form: spring
sense: 15261841-n
part of speech: noun

springtime-n
type: LexicalEntry
canonical form: springtime
sense: 15261841-n
part of speech: noun

15261841-n
type: LexicalConcept
in scheme: en-word.net
definition: the season of growth; spring; the beginning of spring
example: the emerging buds were a sure sign of spring
example: he will hold office until the spring of next year
ili: i117309
lexfile: noun.time
part of speech: noun
hypernym: 15261272-n
mero part: 15248370-n