limitation-n
type: LexicalEntry
canonical form: limitation
sense: 15249089-n
part of speech: noun

15249089-n
type: LexicalConcept
in scheme: en-word.net
definition: (law) a time period after which suits cannot be brought
example: statute of limitations
ili: i117237
lexfile: noun.time
part of speech: noun
domain topic: 08458195-n
hypernym: 15248952-n