calendar month-n
type: LexicalEntry
canonical form: calendar month
sense: 15234209-n
part of speech: noun

month-n
type: LexicalEntry
canonical form: month
sense: 15234209-n
part of speech: noun

15234209-n
type: LexicalConcept
in scheme: en-word.net
definition: one of the twelve divisions of the calendar year
example: he paid the bill last month
ili: i117150
lexfile: noun.time
part of speech: noun
hypernym: 15137796-n
mero part: 15161099-n