Maundy Thursday-n
type: LexicalEntry
canonical form: Maundy Thursday
sense: 15218361-n
part of speech: noun

Holy Thursday-n
type: LexicalEntry
canonical form: Holy Thursday
sense: 15218361-n
part of speech: noun

15218361-n
type: LexicalConcept
in scheme: en-word.net
definition: the Thursday before Easter; commemorates the Last Supper
ili: i117063
lexfile: noun.time
part of speech: noun
hypernym: 15209005-n