date-n
type: LexicalEntry
canonical form: date
sense: 15185626-n
part of speech: noun

15185626-n
type: LexicalConcept
in scheme: en-word.net
definition: the particular day, month, or year (usually according to the Gregorian calendar) that an event occurred
example: he tried to memorizes all the dates for his history class
ili: i116883
lexfile: noun.time
part of speech: noun
hypernym: 15182001-n
hypernym: 15234209-n
hypernym: 15227430-n