burnt umber-n
type: LexicalEntry
canonical form: burnt umber
sense: 15108178-n
part of speech: noun

15108178-n
type: LexicalConcept
in scheme: en-word.net
definition: dark brown pigment obtained by heating umber
ili: i116461
lexfile: noun.substance
part of speech: noun
hypernym: 15107996-n