stripper-n
type: LexicalEntry
canonical form: stripper
sense: 15086117-n
part of speech: noun

15086117-n
type: LexicalConcept
in scheme: en-word.net
definition: a chemical compound used to remove paint or varnish
ili: i116328
lexfile: noun.substance
part of speech: noun
hypernym: 14842408-n