spice-n
type: LexicalEntry
canonical form: spice
sense: 15074578-n
part of speech: noun

15074578-n
type: LexicalConcept
in scheme: en-word.net
definition: aromatic substances of vegetable origin used as a preservative
ili: i116261
lexfile: noun.substance
part of speech: noun
hypernym: 15022096-n