snow-n
type: LexicalEntry
canonical form: snow
sense: 15068330-n
part of speech: noun

15068330-n
type: LexicalConcept
in scheme: en-word.net
definition: a layer of snowflakes (white crystals of frozen water) covering the ground
ili: i116225
lexfile: noun.substance
part of speech: noun
hypernym: 08609236-n
mero substance: 11529484-n