snake oil-n
type: LexicalEntry
canonical form: snake oil
sense: 15068146-n
part of speech: noun

15068146-n
type: LexicalConcept
in scheme: en-word.net
definition: (medicine) any of various liquids sold as medicine (as by a travelling medicine show) but medically worthless
ili: i116224
lexfile: noun.substance
part of speech: noun
domain topic: 06052606-n
hypernym: 14964524-n