siding-n
type: LexicalEntry
canonical form: siding
sense: 15065617-n
part of speech: noun

15065617-n
type: LexicalConcept
in scheme: en-word.net
definition: material applied to the outside of a building to make it weatherproof
ili: i116206
lexfile: noun.substance
part of speech: noun
hypernym: 14810638-n