antitoxin-n
type: LexicalEntry
canonical form: antitoxin
sense: 15052617-n
part of speech: noun

15052617-n
type: LexicalConcept
in scheme: en-word.net
definition: an antibody that can neutralize a specific toxin
ili: i116134
lexfile: noun.substance
part of speech: noun
hypernym: 15051756-n