latex-n
type: LexicalEntry
canonical form: latex
sense: 15030685-n
part of speech: noun

15030685-n
type: LexicalConcept
in scheme: en-word.net
definition: a milky exudate from certain plants that coagulates on exposure to air
ili: i116011
lexfile: noun.substance
part of speech: noun
hypernym: 14877100-n