bole-n
type: LexicalEntry
canonical form: bole
sense: 15015431-n
part of speech: noun

15015431-n
type: LexicalConcept
in scheme: en-word.net
definition: a soft oily clay used as a pigment (especially a reddish brown pigment)
ili: i115921
lexfile: noun.substance
part of speech: noun
hypernym: 15014387-n
hypernym: 14868863-n