gas-n
type: LexicalEntry
canonical form: gas
sense: 14901736-n
part of speech: noun

14901736-n
type: LexicalConcept
in scheme: en-word.net
definition: a fluid in the gaseous state having neither independent shape nor volume and being able to expand indefinitely
ili: i115253
lexfile: noun.substance
part of speech: noun
hypernym: 14963583-n