fuel-n
type: LexicalEntry
canonical form: fuel
sense: 14899228-n
part of speech: noun

14899228-n
type: LexicalConcept
in scheme: en-word.net
definition: a substance that can be consumed to produce energy
example: more fuel is needed during the winter months
example: they developed alternative fuels for aircraft
ili: i115239
lexfile: noun.substance
part of speech: noun
hypernym: 00020270-n