formulation-n
type: LexicalEntry
canonical form: formulation
sense: 14897792-n
part of speech: noun

preparation-n
type: LexicalEntry
canonical form: preparation
sense: 14897792-n
part of speech: noun

14897792-n
type: LexicalConcept
in scheme: en-word.net
definition: a substance prepared according to a formula
example: the physician prescribed a commercial preparation of the medicine
ili: i115233
lexfile: noun.substance
part of speech: noun
hypernym: 14842408-n