formaldehyde-n
type: LexicalEntry
canonical form: formaldehyde
sense: 14897347-n
part of speech: noun

methanal-n
type: LexicalEntry
canonical form: methanal
sense: 14897347-n
part of speech: noun

14897347-n
type: LexicalConcept
in scheme: en-word.net
definition: a colorless poisonous gas; made by the oxidation of methanol
ili: i115231
lexfile: noun.substance
part of speech: noun
hypernym: 14608945-n
hypernym: 14901736-n