extravasation-n
type: LexicalEntry
canonical form: extravasation
sense: 14882945-n
part of speech: noun

14882945-n
type: LexicalConcept
in scheme: en-word.net
definition: an extravasated liquid (blood or lymph or urine); the product of extravasation
ili: i115141
lexfile: noun.substance
part of speech: noun
hypernym: 14964238-n