sewage-n
type: LexicalEntry
canonical form: sewage
sense: 14881044-n
part of speech: noun

sewerage-n
type: LexicalEntry
canonical form: sewerage
sense: 14881044-n
part of speech: noun

14881044-n
type: LexicalConcept
in scheme: en-word.net
definition: waste matter carried away in sewers or drains
ili: i115130
lexfile: noun.substance
part of speech: noun
hypernym: 14880414-n
mero substance: 14881172-n