infusion-n
type: LexicalEntry
canonical form: infusion
sense: 14872955-n
part of speech: noun

extract-n
type: LexicalEntry
canonical form: extract
sense: 14872955-n
part of speech: noun

14872955-n
type: LexicalConcept
in scheme: en-word.net
definition: a solution obtained by steeping or soaking a substance (usually in water)
ili: i115084
lexfile: noun.substance
part of speech: noun
hypernym: 14613403-n