element-n
type: LexicalEntry
canonical form: element
sense: 14864925-n
part of speech: noun

14864925-n
type: LexicalConcept
in scheme: en-word.net
definition: one of four substances thought in ancient and medieval cosmology to constitute the physical universe
example: the alchemists believed that there were four elements
ili: i115043
lexfile: noun.substance
part of speech: noun
hypernym: 00019793-n