clay-n
type: LexicalEntry
canonical form: clay
sense: 14837352-n
part of speech: noun

14837352-n
type: LexicalConcept
in scheme: en-word.net
definition: a very fine-grained soil that is plastic when moist but hard when fired
ili: i114890
lexfile: noun.substance
part of speech: noun
hypernym: 14868863-n
mero substance: 14678720-n