steel-n
type: LexicalEntry
canonical form: steel
sense: 14826620-n
part of speech: noun

14826620-n
type: LexicalConcept
in scheme: en-word.net
definition: an alloy of iron with small amounts of carbon; widely used in construction; mechanical properties can be varied over a wide range
ili: i114826
lexfile: noun.substance
part of speech: noun
hypernym: 14610949-n
mero substance: 14666595-n
mero substance: 15002404-n