blubber-n
type: LexicalEntry
canonical form: blubber
sense: 14806148-n
part of speech: noun

14806148-n
type: LexicalConcept
in scheme: en-word.net
definition: an insulating layer of fat under the skin of whales and other large marine mammals; used as a source of oil
ili: i114700
lexfile: noun.substance
part of speech: noun
hypernym: 14779256-n