mineral-n
type: LexicalEntry
canonical form: mineral
sense: 14686753-n
part of speech: noun

14686753-n
type: LexicalConcept
in scheme: en-word.net
definition: solid homogeneous inorganic substances occurring in nature having a definite chemical composition
ili: i114036
lexfile: noun.substance
part of speech: noun
hypernym: 14604877-n