aggregate-n
type: LexicalEntry
canonical form: aggregate
sense: 14619105-n
part of speech: noun

14619105-n
type: LexicalConcept
in scheme: en-word.net
definition: material such as sand or gravel used with cement and water to make concrete, mortar, or plaster
ili: i113717
lexfile: noun.substance
part of speech: noun
hypernym: 14604877-n