glop-n
type: LexicalEntry
canonical form: glop
sense: 14607753-n
part of speech: noun

14607753-n
type: LexicalConcept
in scheme: en-word.net
definition: any gummy shapeless matter; usually unpleasant
ili: i113660
lexfile: noun.substance
part of speech: noun
hypernym: 00021007-n