material-n
type: LexicalEntry
canonical form: material
sense: 14604877-n
part of speech: noun

stuff-n
type: LexicalEntry
canonical form: stuff
sense: 14604877-n
part of speech: noun

14604877-n
type: LexicalConcept
in scheme: en-word.net
definition: the tangible substance that goes into the makeup of a physical object
example: coal is a hard black material
example: wheat is the stuff they use to make bread
ili: i113651
lexfile: noun.substance
part of speech: noun
hypernym: 00019793-n