preservation-n
type: LexicalEntry
canonical form: preservation
sense: 14602485-n
part of speech: noun

14602485-n
type: LexicalConcept
in scheme: en-word.net
definition: the condition of being (well or ill) preserved
ili: i113639
lexfile: noun.state
part of speech: noun
hypernym: 13943868-n