mechanization-n
type: LexicalEntry
canonical form: mechanization
sense: 14601847-n
part of speech: noun

mechanisation-n
type: LexicalEntry
canonical form: mechanisation
sense: 14601847-n
part of speech: noun

14601847-n
type: LexicalConcept
in scheme: en-word.net
definition: the condition of having a highly technical implementation
ili: i113635
lexfile: noun.state
part of speech: noun
hypernym: 13943868-n