astigmatism-n
type: LexicalEntry
canonical form: astigmatism
sense: 14577182-n
part of speech: noun

astigmia-n
type: LexicalEntry
canonical form: astigmia
sense: 14577182-n
part of speech: noun

14577182-n
type: LexicalConcept
in scheme: en-word.net
definition: (ophthalmology) impaired eyesight resulting usually from irregular conformation of the cornea; common in nearsighted people
ili: i113483
lexfile: noun.state
part of speech: noun
domain topic: 06063977-n
hypernym: 14120206-n