repair-n
type: LexicalEntry
canonical form: repair
sense: 14570303-n
part of speech: noun

14570303-n
type: LexicalConcept
in scheme: en-word.net
definition: a formal way of referring to the condition of something
example: the building was in good repair
ili: i113447
lexfile: noun.state
part of speech: noun
hypernym: 13943868-n