liability-n
type: LexicalEntry
canonical form: liability
sense: 14554005-n
part of speech: noun

14554005-n
type: LexicalConcept
in scheme: en-word.net
definition: the state of being legally obliged and responsible
ili: i113360
lexfile: noun.state
part of speech: noun
hypernym: 14553663-n