mildness-n
type: LexicalEntry
canonical form: mildness
sense: 14546010-n
part of speech: noun

clemency-n
type: LexicalEntry
canonical form: clemency
sense: 14546010-n
part of speech: noun

14546010-n
type: LexicalConcept
in scheme: en-word.net
definition: good weather with comfortable temperatures
ili: i113318
lexfile: noun.state
part of speech: noun
hypernym: 14545715-n